Axis2-1.6.2 - Test Errors while building from source

classic Classic list List threaded Threaded
3 messages Options
Reply | Threaded
Open this post in threaded view
|

Axis2-1.6.2 - Test Errors while building from source

George E. Moore
Experiencing the following errors when building axis2-1.6.2 from source.

 

> Failed tests:
>   test4(org.apache.axis2.jaxws.utility.ClassUtilsTests)
>   test3(org.apache.axis2.jaxws.utility.ClassUtilsTests)
>
> Tests run: 465, Failures: 2, Errors: 0, Skipped: 0
>
> [INFO]
------------------------------------------------------------------------
> [INFO] Reactor Summary:
> [INFO]
> [INFO] Apache Axis2 - Parent ............................. SUCCESS
[1.289s]
> [INFO] Apache Axis2 - Resource bundle .................... SUCCESS
[1.592s]
> [INFO] Apache Axis2 - Kernel ............................. SUCCESS
[22.738s]
> [INFO] Apache Axis2 - Data Binding ....................... SUCCESS
[11.648s]
> [INFO] Apache Axis2 - Transport - Local .................. SUCCESS
[4.109s]
> [INFO] Apache Axis2 - Transport - HTTP ................... SUCCESS
[7.858s]
> [INFO] Apache Axis2 - Code Generation .................... SUCCESS
[10.759s]
> [INFO] Apache Axis2 - ADB Codegen ........................ SUCCESS
[40.323s]
> [INFO] Apache Axis2 - Addressing ......................... SUCCESS
[6.871s]
> [INFO] Apache Axis2 - Java2WSDL .......................... SUCCESS
[10.223s]
> [INFO] Apache Axis2 - tool - Repository Maven Plugin ..... SUCCESS
[3.368s]
> [INFO] Apache Axis2 - Fast Infoset ....................... SUCCESS
[17.999s]
> [INFO] Apache Axis2 - Clustering ......................... SUCCESS
[1:11.170s]
> [INFO] Apache Axis2 - Scripting .......................... SUCCESS
[5.001s]
> [INFO] Apache Axis2 - JAXB-RI Data Binding ............... SUCCESS
[13.139s]
> [INFO] Apache Axis2 - SAAJ ............................... SUCCESS
[24.130s]
> [INFO] Apache Axis2 - Metadata ........................... SUCCESS
[20.163s]
> [INFO] Apache Axis2 - JAXWS .............................. FAILURE
[56.783s]

> [INFO] Apache Axis2 - Test Utilities ..................... SKIPPED
> [INFO] Apache Axis2 - XMLBeans Data Binding .............. SKIPPED
> [INFO] Apache Axis2 - tool - WSDL2Code Maven Plugin ...... SKIPPED
> [INFO] Apache Axis2 - JAXWS Integration Tests ............ SKIPPED
> [INFO] Apache Axis2 - JiBX Data Binding .................. SKIPPED
> [INFO] Apache Axis2 - JSON ............................... SKIPPED
> [INFO] Apache Axis2 - MTOM Policy ........................ SKIPPED
> [INFO] Apache Axis2 - spring ............................. SKIPPED
> [INFO] Apache Axis2 - OSGi Integration ................... SKIPPED
> [INFO] Apache Axis2 - Integration ........................ SKIPPED
> [INFO] Apache Axis2 - MEX ................................ SKIPPED
> [INFO] Apache Axis2 - MTOM Policy module ................. SKIPPED
> [INFO] Apache Axis2 - Ping ............................... SKIPPED
> [INFO] Apache Axis2 - Version Service .................... SKIPPED
> [INFO] Apache Axis2 - SOAP Monitor Servlet ............... SKIPPED
> [INFO] Apache Axis2 - SOAP Monitor Module ................ SKIPPED
> [INFO] Apache Axis2 - tool - AAR Maven Plugin ............ SKIPPED
> [INFO] Apache Axis2 - tool - Ant Plugin .................. SKIPPED
> [INFO] Apache Axis2 - tool - Eclipse Codegen Plugin ...... SKIPPED
> [INFO] Apache Axis2 - tool - Eclipse service Plugin ...... SKIPPED
> [INFO] Apache Axis2 - tool - Intellij IDEA Plugin ........ SKIPPED
> [INFO] Apache Axis2 - tool - Java2WSDL Maven Plugin ...... SKIPPED
> [INFO] Apache Axis2 - tool - MAR Maven Plugin ............ SKIPPED
> [INFO] Apache Axis2 - CORBA .............................. SKIPPED
> [INFO] Apache Axis2 - JAXWS (mar) ........................ SKIPPED
> [INFO] Apache Axis2 - Web Application module ............. SKIPPED
> [INFO] Apache Axis2 - Root ............................... SKIPPED
> [INFO]
------------------------------------------------------------------------
> [INFO] BUILD FAILURE
> [INFO]
------------------------------------------------------------------------
> [INFO] Total time: 5:31.628s
> [INFO] Finished at: Tue Mar 25 12:16:20 EDT 2014
> [INFO] Final Memory: 150M/294M
> [INFO]
------------------------------------------------------------------------
> [ERROR] Failed to execute goal
org.apache.maven.plugins:maven-surefire-plugin:2.4.2:test (default-test)
on project axis2-jaxws: There are test failures.
> [ERROR]
> [ERROR] Please refer
to /home/gem/Development/ApacheAxis2/axis2-1.6.2/modules/jaxws/target/surefire-reports for the individual test results.
> [ERROR] -> [Help 1]
> [ERROR]
> [ERROR] To see the full stack trace of the errors, re-run Maven with
the -e switch.
> [ERROR] Re-run Maven using the -X switch to enable full debug logging.
> [ERROR]
> [ERROR] For more information about the errors and possible solutions,
please read the following articles:
> [ERROR] [Help 1]
http://cwiki.apache.org/confluence/display/MAVEN/MojoFailureException
> [ERROR]
> [ERROR] After correcting the problems, you can resume the build with
the command
> [ERROR]   mvn <goals> -rf :axis2-jaxws
> --
>
>
Have others encountered and reported this as a problem? Are there known
workarounds or ways to exclude these test only?
Would appreciate feedback. Thanks

--




---------------------------------------------------------------------
To unsubscribe, e-mail: [hidden email]
For additional commands, e-mail: [hidden email]

Reply | Threaded
Open this post in threaded view
|

Re: Axis2-1.6.2 - Test Errors while building from source

robertlazarski .
On Tue, Mar 25, 2014 at 7:32 PM, George E. Moore <[hidden email]> wrote:
>> [INFO] Apache Axis2 - JAXWS .............................. FAILURE

I would skip everything by passing:

-Dmaven.test.skip=true

---------------------------------------------------------------------
To unsubscribe, e-mail: [hidden email]
For additional commands, e-mail: [hidden email]

Reply | Threaded
Open this post in threaded view
|

Re: Axis2-1.6.2 - Test Errors while building from source

George E. Moore
Thanks, I've built the package with -Dmaven.test.skip=true. Was curious
whether this was a concern that needed addressing. Thanks again. I'll go
with this.

On Tue, 2014-03-25 at 19:42 -0300, robertlazarski . wrote:

> On Tue, Mar 25, 2014 at 7:32 PM, George E. Moore <[hidden email]> wrote:
> >> [INFO] Apache Axis2 - JAXWS .............................. FAILURE
>
> I would skip everything by passing:
>
> -Dmaven.test.skip=true
>
> ---------------------------------------------------------------------
> To unsubscribe, e-mail: [hidden email]
> For additional commands, e-mail: [hidden email]
>

--




---------------------------------------------------------------------
To unsubscribe, e-mail: [hidden email]
For additional commands, e-mail: [hidden email]